Reaction Details
TargetPyroglutamylated RF-amide peptide receptor
LigandBDBM50019981
Substrate/Competitorn/a
Meas. Tech.ChEMBL_1363387 (CHEMBL3295522)
IC50 7943±n/a nM
Citation Nordqvist, AKristensson, LJohansson, KEIsaksson da Silva, KFex, TTyrchan, CSvensson Henriksson, ANilsson, K New Hits as Antagonists of GPR103 Identified by HTS. ACS Med Chem Lett5:527-32 (2014) 
 
Pyroglutamylated RF-amide peptide receptor
Name:Pyroglutamylated RF-amide peptide receptor
Type:Enzyme Catalytic Domain
Mol. Mass.:49508.46
Organism:Homo sapiens (Human)
Description:GPR103 0 HUMAN::Q96P65
Residue:431
BDBM50019981
NameBDBM50019981
Synonyms:CHEMBL3287835
TypeSmall organic molecule
Emp. Form.C21H25N3O2
Mol. Mass.351.4421
SMILESCOc1ccc(NC(=N)c2ccccc2)cc1CNC(=O)C1CCCC1