Reaction Details
TargetPyroglutamylated RF-amide peptide receptor
LigandBDBM50020012
Substrate/Competitorn/a
Meas. Tech.ChEMBL_1363387 (CHEMBL3295522)
IC50 100±n/a nM
Citation Nordqvist, AKristensson, LJohansson, KEIsaksson da Silva, KFex, TTyrchan, CSvensson Henriksson, ANilsson, K New Hits as Antagonists of GPR103 Identified by HTS. ACS Med Chem Lett5:527-32 (2014) 
 
Pyroglutamylated RF-amide peptide receptor
Name:Pyroglutamylated RF-amide peptide receptor
Type:Enzyme Catalytic Domain
Mol. Mass.:49508.46
Organism:Homo sapiens (Human)
Description:GPR103 0 HUMAN::Q96P65
Residue:431
BDBM50020012
NameBDBM50020012
Synonyms:CHEMBL3287811
TypeSmall organic molecule
Emp. Form.C19H24N2OS2
Mol. Mass.360.537
SMILESCOc1ccc(NC(=N)c2cc(C)cs2)cc1CSC1CCCC1