Reaction Details
TargetPyroglutamylated RF-amide peptide receptor
LigandBDBM50020015
Substrate/Competitorn/a
Meas. Tech.ChEMBL_1363387 (CHEMBL3295522)
IC50 40±n/a nM
Citation Nordqvist, AKristensson, LJohansson, KEIsaksson da Silva, KFex, TTyrchan, CSvensson Henriksson, ANilsson, K New Hits as Antagonists of GPR103 Identified by HTS. ACS Med Chem Lett5:527-32 (2014) 
 
Pyroglutamylated RF-amide peptide receptor
Name:Pyroglutamylated RF-amide peptide receptor
Type:Enzyme Catalytic Domain
Mol. Mass.:49508.46
Organism:Homo sapiens (Human)
Description:GPR103 0 HUMAN::Q96P65
Residue:431
BDBM50020015
NameBDBM50020015
Synonyms:CHEMBL3287814
TypeSmall organic molecule
Emp. Form.C20H23ClN2OS
Mol. Mass.374.927
SMILESCOc1ccc(NC(=N)c2ccc(Cl)cc2)cc1CSC1CCCC1