Reaction Details
TargetPlasminogen
LigandBDBM50020037
Substrate/Competitorn/a
Meas. Tech.ChEMBL_1363410 (CHEMBL3295545)
IC50 390±n/a nM
Citation Cheng, LPettersen, DOhlsson, BSchell, PKarle, MEvertsson, EPahlén, SJonforsen, MPlowright, ATBoström, JFex, TThelin, AHilgendorf, CXue, YWahlund, GLindberg, WLarsson, LOGustafsson, D Discovery of the Fibrinolysis Inhibitor AZD6564, Acting via Interference of a Protein-Protein Interaction. ACS Med Chem Lett5:538-43 (2014) 
 
Plasminogen
Name:Plasminogen
Type:Enzyme
Mol. Mass.:90579.18
Organism:Homo sapiens (Human)
Description:n/a
Residue:810
BDBM50020037
NameBDBM50020037
Synonyms:CHEMBL3287854
TypeSmall organic molecule
Emp. Form.C16H20N2O2
Mol. Mass.272.3422
SMILESO=c1cc(o[nH]1)[C@H]1CCN[C@@H](CCc2ccccc2)C1