Reaction Details
TargetInsulin receptor
LigandBDBM50020044
Substrate/Competitorn/a
Meas. Tech.ChEMBL_1363800 (CHEMBL3294217)
IC50 5700±n/a nM
Citation Zhou, GZorn, NTing, PAslanian, RLin, MCook, JLachowicz, JLin, ASmith, MHwa, Jvan Heek, MWalker, S Development of novel benzomorpholine class of diacylglycerol acyltransferase I inhibitors. ACS Med Chem Lett5:544-9 (2014) 
 
Insulin receptor
Name:Insulin receptor
Type:Receptor Tyrosine Kinase
Mol. Mass.:156322.60
Organism:Homo sapiens (Human)
Description:P06213
Residue:1382
BDBM50020044
NameBDBM50020044
Synonyms:CHEMBL3287898
TypeSmall organic molecule
Emp. Form.C32H36N2O4
Mol. Mass.512.6392
SMILESCCc1ccccc1NC(=O)N1C[C@@H](C)Oc2cc(ccc12)-c1ccc(cc1)[C@H]1CC[C@H](CC(O)=O)CC1