Reaction Details
TargetDiacylglycerol O-acyltransferase 2
LigandBDBM50020045
Substrate/Competitorn/a
Meas. Tech.ChEMBL_1363765 (CHEMBL3294182)
IC50 10000±n/a nM
Citation Zhou, GZorn, NTing, PAslanian, RLin, MCook, JLachowicz, JLin, ASmith, MHwa, Jvan Heek, MWalker, S Development of novel benzomorpholine class of diacylglycerol acyltransferase I inhibitors. ACS Med Chem Lett5:544-9 (2014) 
 
Diacylglycerol O-acyltransferase 2
Name:Diacylglycerol O-acyltransferase 2
Type:Multi-pass membrane protein
Mol. Mass.:43848.90
Organism:Homo sapiens (Human)
Description:Q96PD7
Residue:388
BDBM50020045
NameBDBM50020045
Synonyms:CHEMBL3287865
TypeSmall organic molecule
Emp. Form.C30H32N2O4
Mol. Mass.484.5861
SMILESC[C@@H]1CN(C(=O)Nc2ccccc2)c2ccc(cc2O1)-c1ccc(cc1)[C@H]1CC[C@H](CC(O)=O)CC1