Reaction Details
TargetDiacylglycerol O-acyltransferase 1
LigandBDBM50020070
Substrate/Competitorn/a
Meas. Tech.ChEMBL_1363771 (CHEMBL3294188)
IC50 580±n/a nM
Citation Zhou, GZorn, NTing, PAslanian, RLin, MCook, JLachowicz, JLin, ASmith, MHwa, Jvan Heek, MWalker, S Development of novel benzomorpholine class of diacylglycerol acyltransferase I inhibitors. ACS Med Chem Lett5:544-9 (2014) 
 
Diacylglycerol O-acyltransferase 1
Name:Diacylglycerol O-acyltransferase 1
Type:Protein
Mol. Mass.:55297.82
Organism:Homo sapiens (Human)
Description:O75907
Residue:488
BDBM50020070
NameBDBM50020070
Synonyms:CHEMBL3287881
TypeSmall organic molecule
Emp. Form.C30H32N2O4
Mol. Mass.484.5861
SMILESOC(=O)C[C@H]1CC[C@@H](CC1)c1ccc(cc1)-c1ccc2N(CCOc2c1)C(=O)NCc1ccccc1