Reaction Details
TargetDiacylglycerol O-acyltransferase 1
LigandBDBM50020073
Substrate/Competitorn/a
Meas. Tech.ChEMBL_1363771 (CHEMBL3294188)
IC50 1700±n/a nM
Citation Zhou, GZorn, NTing, PAslanian, RLin, MCook, JLachowicz, JLin, ASmith, MHwa, Jvan Heek, MWalker, S Development of novel benzomorpholine class of diacylglycerol acyltransferase I inhibitors. ACS Med Chem Lett5:544-9 (2014) 
 
Diacylglycerol O-acyltransferase 1
Name:Diacylglycerol O-acyltransferase 1
Type:Protein
Mol. Mass.:55297.82
Organism:Homo sapiens (Human)
Description:O75907
Residue:488
BDBM50020073
NameBDBM50020073
Synonyms:CHEMBL3287873
TypeSmall organic molecule
Emp. Form.C30H28F4N2O4
Mol. Mass.556.5479
SMILESOC(=O)C[C@H]1CC[C@@H](CC1)c1ccc(cc1)-c1ccc2N(CCOc2c1)C(=O)Nc1cc(ccc1F)C(F)(F)F