Reaction Details
TargetSterol O-acyltransferase 2
LigandBDBM50009391
Substrate/Competitorn/a
Meas. Tech.ChEMBL_1363767 (CHEMBL3294184)
IC50 3000±n/a nM
Citation Zhou, GZorn, NTing, PAslanian, RLin, MCook, JLachowicz, JLin, ASmith, MHwa, Jvan Heek, MWalker, S Development of novel benzomorpholine class of diacylglycerol acyltransferase I inhibitors. ACS Med Chem Lett5:544-9 (2014) 
 
Sterol O-acyltransferase 2
Name:Sterol O-acyltransferase 2
Type:Enzyme
Mol. Mass.:59912.75
Organism:Homo sapiens (Human)
Description:O75908
Residue:522
BDBM50009391
NameBDBM50009391
Synonyms:CHEMBL3233872
TypeSmall organic molecule
Emp. Form.C29H28N2O3
Mol. Mass.452.5442
SMILESOC(=O)C[C@H]1CC[C@@H](CC1)c1ccc(cc1)-c1ccc2n(ccc2c1)C(=O)Nc1ccccc1