Reaction Details
TargetDiacylglycerol O-acyltransferase 1
LigandBDBM50020081
Substrate/Competitorn/a
Meas. Tech.ChEMBL_1363772 (CHEMBL3294189)
IC50>10000±n/a nM
Citation Zhou, GZorn, NTing, PAslanian, RLin, MCook, JLachowicz, JLin, ASmith, MHwa, Jvan Heek, MWalker, S Development of novel benzomorpholine class of diacylglycerol acyltransferase I inhibitors. ACS Med Chem Lett5:544-9 (2014) 
 
Diacylglycerol O-acyltransferase 1
Name:Diacylglycerol O-acyltransferase 1
Type:Enzyme
Mol. Mass.:56810.61
Organism:Mus musculus (mouse)
Description:In this assay, recombinant mouse DGAT-1 containing an N-terminal His6-epitope tag was produced in the baculovirus expression system.
Residue:498
BDBM50020081
NameBDBM50020081
Synonyms:CHEMBL3287863
TypeSmall organic molecule
Emp. Form.C30H30N2O5
Mol. Mass.498.5696
SMILESCC1Oc2cc(ccc2N(C(=O)Nc2ccccc2)C1=O)-c1ccc(cc1)[C@H]1CC[C@H](CC(O)=O)CC1