Reaction Details
TargetChloroquine resistance transporter
LigandBDBM81939
Substrate/Competitorn/a
Meas. Tech.ChEMBL_1364181 (CHEMBL3292896)
IC50 33000±n/a nM
Citation Deane, KJSummers, RLLehane, AMMartin, REBarrow, RA Chlorpheniramine Analogues Reverse Chloroquine Resistance in Plasmodium falciparum by Inhibiting PfCRT. ACS Med Chem Lett5:576-81 (2014) 
 
Chloroquine resistance transporter
Name:Chloroquine resistance transporter
Type:PROTEIN
Mol. Mass.:48687.29
Organism:Plasmodium falciparum
Description:ChEMBL_1364181
Residue:424
BDBM81939
NameBDBM81939
Synonyms:CAS_52-53-9 VERAPAMIL
TypeSmall organic molecule
Emp. Form.C27H38N2O4
Mol. Mass.454.6016
SMILESCOc1ccc(CCN(C)CCCC(C#N)(C(C)C)c2ccc(OC)c(OC)c2)cc1OC