Reaction Details
TargetChloroquine resistance transporter
LigandBDBM71542
Substrate/Competitorn/a
Meas. Tech.ChEMBL_1364181 (CHEMBL3292896)
IC50 68000±n/a nM
Citation Deane, KJSummers, RLLehane, AMMartin, REBarrow, RA Chlorpheniramine Analogues Reverse Chloroquine Resistance in Plasmodium falciparum by Inhibiting PfCRT. ACS Med Chem Lett5:576-81 (2014) 
 
Chloroquine resistance transporter
Name:Chloroquine resistance transporter
Type:PROTEIN
Mol. Mass.:48687.29
Organism:Plasmodium falciparum
Description:ChEMBL_1364181
Residue:424
BDBM71542
NameBDBM71542
Synonyms:(4-amino-1-methyl-butyl)-(6-methoxy-8-quinolyl)amine;phosphoric acid MLS001334045 N4-(6-methoxyquinolin-8-yl)pentane-1,4-diamine;phosphoric acid SMR000875314 | cid_359247
TypeSmall organic molecule
Emp. Form.C15H21N3O
Mol. Mass.259.3467
SMILESCOc1cc(NC(C)CCCN)c2ncccc2c1