Reaction Details
TargetVascular endothelial growth factor receptor 2
LigandBDBM50020238
Substrate/Competitorn/a
Meas. Tech.ChEMBL_1364556 (CHEMBL3295611)
IC50 7.0±n/a nM
Citation Lv, YLi, MLiu, TTong, LPeng, TWei, LDing, JXie, HDuan, W Discovery of a New Series of Naphthamides as Potent VEGFR-2 Kinase Inhibitors. ACS Med Chem Lett5:592-7 (2014) 
 
Vascular endothelial growth factor receptor 2
Name:Vascular endothelial growth factor receptor 2
Type:Receptor Tyrosine Kinase
Mol. Mass.:151510.97
Organism:Homo sapiens (Human)
Description:P35968
Residue:1356
BDBM50020238
NameBDBM50020238
Synonyms:CHEMBL3288522 | US9914707, I-26
TypeSmall organic molecule
Emp. Form.C20H18N4O
Mol. Mass.330.3831
SMILESCCNC(=O)c1cccc2cc(ccc12)-c1cccc2[nH]nc(N)c12