Reaction Details
TargetVascular endothelial growth factor receptor 2
LigandBDBM50020169
Substrate/Competitorn/a
Meas. Tech.ChEMBL_1364555 (CHEMBL3295610)
IC50 18±n/a nM
Citation Lv, YLi, MLiu, TTong, LPeng, TWei, LDing, JXie, HDuan, W Discovery of a New Series of Naphthamides as Potent VEGFR-2 Kinase Inhibitors. ACS Med Chem Lett5:592-7 (2014) 
 
Vascular endothelial growth factor receptor 2
Name:Vascular endothelial growth factor receptor 2
Type:Receptor Tyrosine Kinase
Mol. Mass.:151510.97
Organism:Homo sapiens (Human)
Description:P35968
Residue:1356
BDBM50020169
NameBDBM50020169
Synonyms:CHEMBL3288506 | US9914707, I-9
TypeSmall organic molecule
Emp. Form.C26H22N4O
Mol. Mass.406.4791
SMILESCCc1cccc(NC(=O)c2cccc3cc(ccc23)-c2cccc3[nH]nc(N)c23)c1