Reaction Details
TargetVascular endothelial growth factor receptor 2
LigandBDBM50020235
Substrate/Competitorn/a
Meas. Tech.ChEMBL_1364555 (CHEMBL3295610)
IC50 19±n/a nM
Citation Lv, YLi, MLiu, TTong, LPeng, TWei, LDing, JXie, HDuan, W Discovery of a New Series of Naphthamides as Potent VEGFR-2 Kinase Inhibitors. ACS Med Chem Lett5:592-7 (2014) 
 
Vascular endothelial growth factor receptor 2
Name:Vascular endothelial growth factor receptor 2
Type:Receptor Tyrosine Kinase
Mol. Mass.:151510.97
Organism:Homo sapiens (Human)
Description:P35968
Residue:1356
BDBM50020235
NameBDBM50020235
Synonyms:CHEMBL3288511 | US9914707, I-10
TypeSmall organic molecule
Emp. Form.C24H17FN4O
Mol. Mass.396.4164
SMILESNc1n[nH]c2cccc(-c3ccc4c(cccc4c3)C(=O)Nc3ccccc3F)c12