Reaction Details
TargetVascular endothelial growth factor receptor 2
LigandBDBM50020236
Substrate/Competitorn/a
Meas. Tech.ChEMBL_1364556 (CHEMBL3295611)
IC50 21±n/a nM
Citation Lv, YLi, MLiu, TTong, LPeng, TWei, LDing, JXie, HDuan, W Discovery of a New Series of Naphthamides as Potent VEGFR-2 Kinase Inhibitors. ACS Med Chem Lett5:592-7 (2014) 
 
Vascular endothelial growth factor receptor 2
Name:Vascular endothelial growth factor receptor 2
Type:Receptor Tyrosine Kinase
Mol. Mass.:151510.97
Organism:Homo sapiens (Human)
Description:P35968
Residue:1356
BDBM50020236
NameBDBM50020236
Synonyms:CHEMBL3288524 | US9914707, I-2
TypeSmall organic molecule
Emp. Form.C24H17N3O2
Mol. Mass.379.4107
SMILESNc1nccc2occ(-c3ccc4c(cccc4c3)C(=O)Nc3ccccc3)c12