Reaction Details
TargetFibroblast growth factor receptor 1
LigandBDBM50020165
Substrate/Competitorn/a
Meas. Tech.ChEMBL_1364562 (CHEMBL3295617)
IC50 644±n/a nM
Citation Lv, YLi, MLiu, TTong, LPeng, TWei, LDing, JXie, HDuan, W Discovery of a New Series of Naphthamides as Potent VEGFR-2 Kinase Inhibitors. ACS Med Chem Lett5:592-7 (2014) 
 
Fibroblast growth factor receptor 1
Name:Fibroblast growth factor receptor 1
Type:Receptor
Mol. Mass.:91861.70
Organism:Homo sapiens (Human)
Description:P11362
Residue:822
BDBM50020165
NameBDBM50020165
Synonyms:CHEMBL3288526 | US9914707, I-4
TypeSmall organic molecule
Emp. Form.C23H16N4OS
Mol. Mass.396.464
SMILESNc1ncnc2scc(-c3ccc4c(cccc4c3)C(=O)Nc3ccccc3)c12