Reaction Details
TargetTyrosine-protein kinase receptor UFO
LigandBDBM50020310
Substrate/Competitorn/a
Meas. Tech.ChEMBL_1365403 (CHEMBL3296762)
Ki 63±n/a nM
Citation Zhang, LZheng, QYang, YZhou, HGong, XZhao, SFan, C Synthesis and in vivo SAR study of indolin-2-one-based multi-targeted inhibitors as potential anticancer agents. Eur J Med Chem82:139-51 (2014) 
 
Tyrosine-protein kinase receptor UFO
Name:Tyrosine-protein kinase receptor UFO
Type:Enzyme
Mol. Mass.:98316.97
Organism:Homo sapiens (Human)
Description:P30530
Residue:894
BDBM50020310
NameBDBM50020310
Synonyms:CHEMBL3288854
TypeSmall organic molecule
Emp. Form.C23H28FN5O2
Mol. Mass.425.4991
SMILESCN1CCN(CCC(=O)Nc2c(C)[nH]c(\C=C3/C(=O)Nc4ccc(F)cc34)c2C)CC1