Reaction Details
TargetAccessory gene regulator protein A
LigandBDBM50020380
Substrate/Competitorn/a
Meas. Tech.ChEMBL_1366621 (CHEMBL3296715)
IC50 30100±n/a nM
Citation Figueroa, MJarmusch, AKRaja, HAEl-Elimat, TKavanaugh, JSHorswill, ARCooks, RGCech, NBOberlies, NH Polyhydroxyanthraquinones as quorum sensing inhibitors from the guttates of Penicillium restrictum and their analysis by desorption electrospray ionization mass spectrometry. J Nat Prod77:1351-8 (2014) 
 
Accessory gene regulator protein A
Name:Accessory gene regulator protein A
Type:PROTEIN
Mol. Mass.:27903.57
Organism:Staphylococcus aureus
Description:ChEMBL_1366621
Residue:238
BDBM50020380
NameBDBM50020380
Synonyms:CHEMBL3289789
TypeSmall organic molecule
Emp. Form.C17H12O7
Mol. Mass.328.273
SMILESCC(=O)C(O)c1cc(O)c2C(=O)c3c(O)cc(O)cc3C(=O)c2c1