Reaction Details
TargetAccessory gene regulator protein A
LigandBDBM50312649
Substrate/Competitorn/a
Meas. Tech.ChEMBL_1366621 (CHEMBL3296715)
IC50 37800±n/a nM
Citation Figueroa, MJarmusch, AKRaja, HAEl-Elimat, TKavanaugh, JSHorswill, ARCooks, RGCech, NBOberlies, NH Polyhydroxyanthraquinones as quorum sensing inhibitors from the guttates of Penicillium restrictum and their analysis by desorption electrospray ionization mass spectrometry. J Nat Prod77:1351-8 (2014) 
 
Accessory gene regulator protein A
Name:Accessory gene regulator protein A
Type:PROTEIN
Mol. Mass.:27903.57
Organism:Staphylococcus aureus
Description:ChEMBL_1366621
Residue:238
BDBM50312649
NameBDBM50312649
Synonyms:6-chloro-4,5,7-trihydroxy-9,10-dioxo-9,10-dihydroanthracene-2-carboxylic acid | CHEMBL1089732
TypeSmall organic molecule
Emp. Form.C15H7ClO7
Mol. Mass.334.665
SMILESOC(=O)c1cc(O)c2C(=O)c3c(O)c(Cl)c(O)cc3C(=O)c2c1