Reaction Details
TargetTyrosine-protein kinase ITK/TSK
LigandBDBM50020471
Substrate/Competitorn/a
Meas. Tech.ChEMBL_1361209 (CHEMBL3292441)
IC50>30000±n/a nM
Citation Li, XZuo, YTang, GWang, YZhou, YWang, XGuo, TXia, MDing, NPan, Z Discovery of a series of 2,5-diaminopyrimidine covalent irreversible inhibitors of Bruton's tyrosine kinase with in vivo antitumor activity. J Med Chem57:5112-28 (2014) 
 
Tyrosine-protein kinase ITK/TSK
Name:Tyrosine-protein kinase ITK/TSK
Type:Protein
Mol. Mass.:71839.20
Organism:Homo sapiens (Human)
Description:Q08881
Residue:620
BDBM50020471
NameBDBM50020471
Synonyms:CHEMBL3290142
TypeSmall organic molecule
Emp. Form.C29H23F3N6O3
Mol. Mass.560.5265
SMILESCc1ccc(NC(=O)c2cccc(c2)C(F)(F)F)cc1C(=O)Nc1cnc(Nc2cccc(NC(=O)C=C)c2)nc1