Reaction Details
TargetPolyunsaturated fatty acid 5-lipoxygenase
LigandBDBM50020565
Substrate/Competitorn/a
Meas. Tech.ChEMBL_1361561 (CHEMBL3295128)
IC50 1700±n/a nM
Citation Koeberle, AMuņoz, EAppendino, GBMinassi, APace, SRossi, AWeinigel, CBarz, DSautebin, LCaprioglio, DCollado, JAWerz, O SAR studies on curcumin's pro-inflammatory targets: discovery of prenylated pyrazolocurcuminoids as potent and selective novel inhibitors of 5-lipoxygenase. J Med Chem57:5638-48 (2014) 
 
Polyunsaturated fatty acid 5-lipoxygenase
Name:Polyunsaturated fatty acid 5-lipoxygenase
Type:Enzyme
Mol. Mass.:77972.74
Organism:Homo sapiens (Human)
Description:Recombinant protein was purified from E. coli lysate. After ammonium sulfate precipitation and subsequent steps, the supernatant (S100) was used for 5-LO activity assay.
Residue:674
BDBM50020565
NameBDBM50020565
Synonyms:CHEMBL2392188
TypeSmall organic molecule
Emp. Form.C29H34O5
Mol. Mass.462.5773
SMILES[#6]-[#8]-c1cc(\[#6]=[#6]\[#6](=O)\[#6]=[#6]\c2cc(-[#6]\[#6]=[#6](\[#6])-[#6])c(-[#8])c(-[#8]-[#6])c2)cc(-[#6]\[#6]=[#6](/[#6])-[#6])c1-[#8]