Reaction Details
TargetPolyunsaturated fatty acid 5-lipoxygenase
LigandBDBM50163748
Substrate/Competitorn/a
Meas. Tech.ChEMBL_1361577 (CHEMBL3295144)
IC50 13±n/a nM
Citation Koeberle, AMuņoz, EAppendino, GBMinassi, APace, SRossi, AWeinigel, CBarz, DSautebin, LCaprioglio, DCollado, JAWerz, O SAR studies on curcumin's pro-inflammatory targets: discovery of prenylated pyrazolocurcuminoids as potent and selective novel inhibitors of 5-lipoxygenase. J Med Chem57:5638-48 (2014) 
 
Polyunsaturated fatty acid 5-lipoxygenase
Name:Polyunsaturated fatty acid 5-lipoxygenase
Type:Enzyme
Mol. Mass.:77972.74
Organism:Homo sapiens (Human)
Description:Recombinant protein was purified from E. coli lysate. After ammonium sulfate precipitation and subsequent steps, the supernatant (S100) was used for 5-LO activity assay.
Residue:674
BDBM50163748
NameBDBM50163748
Synonyms:(E)-3,5-Bis[beta-(4-Hydroxy-3-methoxyphenyl)-ethenyl]-1H-pyrazole 4,40-(1E,10E)-2,20-(1-H-Pyrazole-3,5-diyl)bis(ethene-2,1-diyl)bis(2-methoxyphenol) 4-(2-(5-(4-hydroxy-3-methoxystyryl)-1H-pyrazol-3-yl)vinyl)-2-methoxyphenol | CHEMBL180239
TypeSmall organic molecule
Emp. Form.C21H20N2O4
Mol. Mass.364.3945
SMILESCOc1cc(\C=C\c2cc(\C=C\c3ccc(O)c(OC)c3)[nH]n2)ccc1O