Reaction Details
TargetPolyunsaturated fatty acid 5-lipoxygenase
LigandBDBM50020589
Substrate/Competitorn/a
Meas. Tech.ChEMBL_1361561 (CHEMBL3295128)
IC50 800±n/a nM
Citation Koeberle, AMuņoz, EAppendino, GBMinassi, APace, SRossi, AWeinigel, CBarz, DSautebin, LCaprioglio, DCollado, JAWerz, O SAR studies on curcumin's pro-inflammatory targets: discovery of prenylated pyrazolocurcuminoids as potent and selective novel inhibitors of 5-lipoxygenase. J Med Chem57:5638-48 (2014) 
 
Polyunsaturated fatty acid 5-lipoxygenase
Name:Polyunsaturated fatty acid 5-lipoxygenase
Type:Enzyme
Mol. Mass.:77972.74
Organism:Homo sapiens (Human)
Description:Recombinant protein was purified from E. coli lysate. After ammonium sulfate precipitation and subsequent steps, the supernatant (S100) was used for 5-LO activity assay.
Residue:674
BDBM50020589
NameBDBM50020589
Synonyms:CHEMBL3290441
TypeSmall organic molecule
Emp. Form.C31H36N2O4
Mol. Mass.500.6285
SMILESCOc1cc(\C=C\c2cc(\C=C\c3cc(CC=C(C)C)c(O)c(OC)c3)[nH]n2)cc(CC=C(C)C)c1O