Reaction Details
TargetCannabinoid receptor 2
LigandBDBM50180022
Substrate/Competitorn/a
Meas. Tech.ChEMBL_1361901 (CHEMBL3293297)
Ki 0.280000±n/a nM
Citation Pinna, GLoriga, GLazzari, PRuiu, SFalzoi, MFrau, SPau, AMurineddu, GAsproni, BPinna, GA Tricyclic pyrazoles. Part 6. Benzofuro[3,2-c]pyrazole: a versatile architecture for CB2 selective ligands. Eur J Med Chem82:281-92 (2014) 
 
Cannabinoid receptor 2
Name:Cannabinoid receptor 2
Type:G Protein-Coupled Receptor (GPCR)
Mol. Mass.:39690.94
Organism:Homo sapiens (Human)
Description:P34972
Residue:360
BDBM50180022
NameBDBM50180022
Synonyms:5-(4-chloro-3-methyl-phenyl)-1-(4-methyl-benzyl)-1H-pyrazole-3-carboxylic acid (1,3,3-trimethyl-bicyclo[2.2.1]hept-2-yl)-amide | CHEMBL381689
TypeSmall organic molecule
Emp. Form.C29H34ClN3O
Mol. Mass.476.053
SMILESCc1ccc(Cn2nc(cc2-c2ccc(Cl)c(C)c2)C(=O)NC2C3(C)CCC(C3)C2(C)C)cc1