Reaction Details
TargetCannabinoid receptor 2
LigandBDBM50020595
Substrate/Competitorn/a
Meas. Tech.ChEMBL_1361903 (CHEMBL3293299)
Ki 18±n/a nM
Citation Pinna, GLoriga, GLazzari, PRuiu, SFalzoi, MFrau, SPau, AMurineddu, GAsproni, BPinna, GA Tricyclic pyrazoles. Part 6. Benzofuro[3,2-c]pyrazole: a versatile architecture for CB2 selective ligands. Eur J Med Chem82:281-92 (2014) 
 
Cannabinoid receptor 2
Name:Cannabinoid receptor 2
Type:Enzyme Catalytic Domain
Mol. Mass.:38220.43
Organism:MOUSE
Description:P47936
Residue:347
BDBM50020595
NameBDBM50020595
Synonyms:CHEMBL3290445
TypeSmall organic molecule
Emp. Form.C27H25Cl2N3O2
Mol. Mass.494.412
SMILESCc1ccc2c(c1)oc1c(nn(-c3ccc(Cl)cc3Cl)c21)C(=O)NC1C2CC3CC(C2)CC1C3