Reaction Details
TargetPoly [ADP-ribose] polymerase 1
LigandBDBM50020618
Substrate/Competitorn/a
Meas. Tech.ChEMBL_1361917 (CHEMBL3293313)
IC50 12020±n/a nM
Citation Patel, MRBhatt, ASteffen, JDChergui, AMurai, JPommier, YPascal, JMTrombetta, LDFronczek, FRTalele, TT Discovery and structure-activity relationship of novel 2,3-dihydrobenzofuran-7-carboxamide and 2,3-dihydrobenzofuran-3(2H)-one-7-carboxamide derivatives as poly(ADP-ribose)polymerase-1 inhibitors. J Med Chem57:5579-601 (2014) 
 
Poly [ADP-ribose] polymerase 1
Name:Poly [ADP-ribose] polymerase 1
Type:n/a
Mol. Mass.:113114.22
Organism:Homo sapiens (Human)
Description:P09874
Residue:1014
BDBM50020618
NameBDBM50020618
Synonyms:CHEMBL3290468
TypeSmall organic molecule
Emp. Form.C16H11NO3
Mol. Mass.265.2634
SMILESNC(=O)c1cccc2C(=O)\C(Oc12)=C\c1ccccc1