Reaction Details
TargetPoly [ADP-ribose] polymerase 1
LigandBDBM50020634
Substrate/Competitorn/a
Meas. Tech.ChEMBL_1361917 (CHEMBL3293313)
IC50 114±n/a nM
Citation Patel, MRBhatt, ASteffen, JDChergui, AMurai, JPommier, YPascal, JMTrombetta, LDFronczek, FRTalele, TT Discovery and structure-activity relationship of novel 2,3-dihydrobenzofuran-7-carboxamide and 2,3-dihydrobenzofuran-3(2H)-one-7-carboxamide derivatives as poly(ADP-ribose)polymerase-1 inhibitors. J Med Chem57:5579-601 (2014) 
 
Poly [ADP-ribose] polymerase 1
Name:Poly [ADP-ribose] polymerase 1
Type:n/a
Mol. Mass.:113114.22
Organism:Homo sapiens (Human)
Description:P09874
Residue:1014
BDBM50020634
NameBDBM50020634
Synonyms:CHEMBL3290484
TypeSmall organic molecule
Emp. Form.C23H25N3O4
Mol. Mass.407.4623
SMILESCN1CCN(CCOc2ccc(\C=C3/Oc4c(cccc4C(N)=O)C3=O)cc2)CC1