Reaction Details
TargetPoly [ADP-ribose] polymerase 1
LigandBDBM50020637
Substrate/Competitorn/a
Meas. Tech.ChEMBL_1361917 (CHEMBL3293313)
IC50 223±n/a nM
Citation Patel, MRBhatt, ASteffen, JDChergui, AMurai, JPommier, YPascal, JMTrombetta, LDFronczek, FRTalele, TT Discovery and structure-activity relationship of novel 2,3-dihydrobenzofuran-7-carboxamide and 2,3-dihydrobenzofuran-3(2H)-one-7-carboxamide derivatives as poly(ADP-ribose)polymerase-1 inhibitors. J Med Chem57:5579-601 (2014) 
 
Poly [ADP-ribose] polymerase 1
Name:Poly [ADP-ribose] polymerase 1
Type:n/a
Mol. Mass.:113114.22
Organism:Homo sapiens (Human)
Description:P09874
Residue:1014
BDBM50020637
NameBDBM50020637
Synonyms:CHEMBL3290486
TypeSmall organic molecule
Emp. Form.C22H20N2O6
Mol. Mass.408.404
SMILESNC(=O)c1cccc2C(=O)\C(Oc12)=C\c1ccc(OCC(=O)N2CCOCC2)cc1