Reaction Details
TargetDNA polymerase beta
LigandBDBM50020659
Substrate/Competitorn/a
Meas. Tech.ChEMBL_1361926 (CHEMBL3293530)
IC50 9500±n/a nM
Citation Le, DHTakenaka, YHamada, NMizushina, YTanahashi, T Polyketides from the cultured lichen mycobiont of a Vietnamese Pyrenula sp. J Nat Prod77:1404-12 (2014) 
 
DNA polymerase beta
Name:DNA polymerase beta
Type:PROTEIN
Mol. Mass.:38334.34
Organism:Rattus norvegicus
Description:ChEMBL_1361926
Residue:335
BDBM50020659
NameBDBM50020659
Synonyms:CHEMBL3290498
TypeSmall organic molecule
Emp. Form.C26H36O3
Mol. Mass.396.5622
SMILES[H][C@@]1(O[C@]1(C)[C@@]1([H])[C@@H](\C=C\C=C\C=C\C(O)=O)[C@]2([H])CC=C(C)C[C@@]2([H])C=C1C)[C@H](C)CC