Reaction Details
TargetDNA polymerase beta
LigandBDBM50020661
Substrate/Competitorn/a
Meas. Tech.ChEMBL_1361926 (CHEMBL3293530)
IC50 37900±n/a nM
Citation Le, DHTakenaka, YHamada, NMizushina, YTanahashi, T Polyketides from the cultured lichen mycobiont of a Vietnamese Pyrenula sp. J Nat Prod77:1404-12 (2014) 
 
DNA polymerase beta
Name:DNA polymerase beta
Type:PROTEIN
Mol. Mass.:38334.34
Organism:Rattus norvegicus
Description:ChEMBL_1361926
Residue:335
BDBM50020661
NameBDBM50020661
Synonyms:CHEMBL3290500
TypeSmall organic molecule
Emp. Form.C26H36O5
Mol. Mass.428.561
SMILES[H][C@@]12CC(C)=CC[C@@]1([H])[C@]1([H])[C@H](O)[C@H](O[C@]3([H])[C@H](C)CCO[C@@]3(C)[C@]1([H])C(C)=C2)\C=C\C=C\C(O)=O