Reaction Details
TargetTyrosinase
LigandBDBM23926
Substrate/Competitorn/a
Meas. Tech.ChEMBL_1363427 (CHEMBL3295816)
Ki 2900000±n/a nM
Citation Cheung, FWLeung, AWLiu, WKChe, CT Tyrosinase inhibitory activity of a glucosylated hydroxystilbene in mouse melan-a melanocytes. J Nat Prod77:1270-4 (2014) 
 
Tyrosinase
Name:Tyrosinase
Type:Protein
Mol. Mass.:60600.74
Organism:Mus musculus (Mouse)
Description:n/a
Residue:533
BDBM23926
NameBDBM23926
Synonyms:(E)-resveratrol CHEMBL165 Stilbene, 2f cid_445154 trans-resveratrol
TypeSmall organic molecule
Emp. Form.C14H12O3
Mol. Mass.228.2433
SMILESOc1ccc(\C=C\c2cc(O)cc(O)c2)cc1