Reaction Details
TargetMatrix protein 2
LigandBDBM50020751
Substrate/Competitorn/a
Meas. Tech.ChEMBL_1364624 (CHEMBL3291757)
IC50 1500±n/a nM
Citation Rey-Carrizo, MBarniol-Xicota, MMa, CFrigolé-Vivas, MTorres, ENaesens, LLlabrés, SJuárez-Jiménez, JLuque, FJDeGrado, WFLamb, RAPinto, LHVázquez, S Easily accessible polycyclic amines that inhibit the wild-type and amantadine-resistant mutants of the M2 channel of influenza A virus. J Med Chem57:5738-47 (2014) 
 
Matrix protein 2
Name:Matrix protein 2
Type:PROTEIN
Mol. Mass.:11180.06
Organism:Influenza A virus (A/Udorn/307/1972(H3N2))
Description:ChEMBL_22
Residue:97
BDBM50020751
NameBDBM50020751
Synonyms:CHEMBL3286971
TypeSmall organic molecule
Emp. Form.C12H18ClN3
Mol. Mass.239.744
SMILESCl.NC(=N)N1CC2C(C1)C1C=CC2C2CC12