Reaction Details
TargetMicrotubule-associated protein tau
LigandBDBM50020860
Substrate/Competitorn/a
Meas. Tech.ChEMBL_1364642 (CHEMBL3291775)
IC50 2.0±n/a nM
Citation Blass, B Imidazo[2,1]thiazol-3-one Derivatives Useful as Diagnostic Agents for Alzheimer's Disease. ACS Med Chem Lett5:619-20 (2014) 
 
Microtubule-associated protein tau
Name:Microtubule-associated protein tau
Type:Protein
Mol. Mass.:78928.63
Organism:Homo sapiens (Human)
Description:P10636
Residue:758
BDBM50020860
NameBDBM50020860
Synonyms:CHEMBL3286983
TypeSmall organic molecule
Emp. Form.C19H12Cl2N2O3S
Mol. Mass.419.281
SMILESCOc1cc(\C=c2/sc3nc(cn3c2=O)-c2ccc(Cl)cc2)cc(Cl)c1O