Reaction Details
TargetMicrotubule-associated protein tau
LigandBDBM50020862
Substrate/Competitorn/a
Meas. Tech.ChEMBL_1364642 (CHEMBL3291775)
IC50 5.0±n/a nM
Citation Blass, B Imidazo[2,1]thiazol-3-one Derivatives Useful as Diagnostic Agents for Alzheimer's Disease. ACS Med Chem Lett5:619-20 (2014) 
 
Microtubule-associated protein tau
Name:Microtubule-associated protein tau
Type:Protein
Mol. Mass.:78928.63
Organism:Homo sapiens (Human)
Description:P10636
Residue:758
BDBM50020862
NameBDBM50020862
Synonyms:CHEMBL3286985
TypeSmall organic molecule
Emp. Form.C19H13ClN2O4S
Mol. Mass.400.836
SMILESCOc1cc(\C=c2/sc3nc(cn3c2=O)-c2ccc(Cl)cc2)cc(O)c1O