Reaction Details
TargetMicrotubule-associated protein tau
LigandBDBM50020865
Substrate/Competitorn/a
Meas. Tech.ChEMBL_1364642 (CHEMBL3291775)
IC50 1.000000±n/a nM
Citation Blass, B Imidazo[2,1]thiazol-3-one Derivatives Useful as Diagnostic Agents for Alzheimer's Disease. ACS Med Chem Lett5:619-20 (2014) 
 
Microtubule-associated protein tau
Name:Microtubule-associated protein tau
Type:Protein
Mol. Mass.:78928.63
Organism:Homo sapiens (Human)
Description:P10636
Residue:758
BDBM50020865
NameBDBM50020865
Synonyms:CHEMBL3286988
TypeSmall organic molecule
Emp. Form.C20H15ClN2O4S
Mol. Mass.414.862
SMILESCOc1cc(\C=c2/sc3nc(cn3c2=O)-c2cccc(Cl)c2)cc(OC)c1O