Reaction Details
TargetHistone deacetylase 1
LigandBDBM50020905
Substrate/Competitorn/a
Meas. Tech.ChEMBL_1364645 (CHEMBL3291778)
IC50 50±n/a nM
Citation Chen, FChai, HSu, MBZhang, YMLi, JXie, XNan, FJ Potent and orally efficacious bisthiazole-based histone deacetylase inhibitors. ACS Med Chem Lett5:628-33 (2014) 
 
Histone deacetylase 1
Name:Histone deacetylase 1
Type:Enzyme
Mol. Mass.:55090.27
Organism:Homo sapiens (Human)
Description:Q13547
Residue:482
BDBM50020905
NameBDBM50020905
Synonyms:CHEMBL3287263 | US9216962, CFH461
TypeSmall organic molecule
Emp. Form.C21H24N4O4S2
Mol. Mass.460.57
SMILESONC(=O)CCCCNC(=O)c1nc(sc1CCOCc1ccccc1)-c1nccs1