Reaction Details
TargetHistone deacetylase 3
LigandBDBM50020915
Substrate/Competitorn/a
Meas. Tech.ChEMBL_1364647 (CHEMBL3291780)
IC50 60±n/a nM
Citation Chen, FChai, HSu, MBZhang, YMLi, JXie, XNan, FJ Potent and orally efficacious bisthiazole-based histone deacetylase inhibitors. ACS Med Chem Lett5:628-33 (2014) 
 
Histone deacetylase 3
Name:Histone deacetylase 3
Type:Enzyme
Mol. Mass.:48829.55
Organism:Homo sapiens (Human)
Description:O15379
Residue:428
BDBM50020915
NameBDBM50020915
Synonyms:CHEMBL3287008 | US9216962, CFH412-S
TypeSmall organic molecule
Emp. Form.C17H21N3O3S3
Mol. Mass.411.562
SMILESCC(C)[C@H](NC(=O)c1csc(n1)-c1cscn1)C(=O)OC\C=C\CCS