Reaction Details
TargetHistone deacetylase 6
LigandBDBM50020912
Substrate/Competitorn/a
Meas. Tech.ChEMBL_1364649 (CHEMBL3293471)
IC50 49±n/a nM
Citation Chen, FChai, HSu, MBZhang, YMLi, JXie, XNan, FJ Potent and orally efficacious bisthiazole-based histone deacetylase inhibitors. ACS Med Chem Lett5:628-33 (2014) 
 
Histone deacetylase 6
Name:Histone deacetylase 6
Type:Chromatin regulator; hydrolase; repressor
Mol. Mass.:131381.51
Organism:Homo sapiens (Human)
Description:Q9UBN7
Residue:1215
BDBM50020912
NameBDBM50020912
Synonyms:Largazole Thiol
TypeSmall organic molecule
Emp. Form.C21H28N4O4S3
Mol. Mass.496.666
SMILES[H][C@]1(CC(=O)NCc2nc(cs2)C2=N[C@@](C)(CS2)C(=O)N[C@H](C(C)C)C(=O)O1)\C=C\CCS