Reaction Details
TargetHistone deacetylase 6
LigandBDBM50020911
Substrate/Competitorn/a
Meas. Tech.ChEMBL_1364649 (CHEMBL3293471)
IC50 190±n/a nM
Citation Chen, FChai, HSu, MBZhang, YMLi, JXie, XNan, FJ Potent and orally efficacious bisthiazole-based histone deacetylase inhibitors. ACS Med Chem Lett5:628-33 (2014) 
 
Histone deacetylase 6
Name:Histone deacetylase 6
Type:Chromatin regulator; hydrolase; repressor
Mol. Mass.:131381.51
Organism:Homo sapiens (Human)
Description:Q9UBN7
Residue:1215
BDBM50020911
NameBDBM50020911
Synonyms:CHEMBL3287269 | US9216962, CFH409-A
TypeSmall organic molecule
Emp. Form.C18H24N4O3S2
Mol. Mass.408.538
SMILESCC(C)C1CC1c1sc(nc1C(=O)NCCCCC(=O)NO)-c1nccs1