Reaction Details
TargetHistone deacetylase 1
LigandBDBM50020913
Substrate/Competitorn/a
Meas. Tech.ChEMBL_1364645 (CHEMBL3291778)
IC50 77±n/a nM
Citation Chen, FChai, HSu, MBZhang, YMLi, JXie, XNan, FJ Potent and orally efficacious bisthiazole-based histone deacetylase inhibitors. ACS Med Chem Lett5:628-33 (2014) 
 
Histone deacetylase 1
Name:Histone deacetylase 1
Type:Enzyme
Mol. Mass.:55090.27
Organism:Homo sapiens (Human)
Description:Q13547
Residue:482
BDBM50020913
NameBDBM50020913
Synonyms:CHEMBL3287006
TypeSmall organic molecule
Emp. Form.C20H24N4O4S3
Mol. Mass.480.624
SMILESCC(C)[C@@H]1NC(=O)c2csc(n2)-c2csc(CNC(=O)C[C@H](OC1=O)\C=C\CCS)n2