Reaction Details
TargetSomatostatin receptor type 1
LigandBDBM50021063
Substrate/Competitorn/a
Meas. Tech.ChEMBL_1365878 (CHEMBL3296536)
Ki 656±n/a nM
Citation Li, DWu, ZYu, YBall, RGGuo, LSherer, EHe, SHong, QLai, ZQi, HTruong, QYang, DXChicchi, GGTsao, KLTrusca, DTrujillo, MPachanski, MEiermann, GJHoward, ADZhou, YPZhang, BBNargund, RPHagmann, WK Diamine Derivatives as Novel Small-Molecule, Potent, and Subtype-Selective Somatostatin SST3 Receptor Agonists. ACS Med Chem Lett5:690-5 (2014) 
 
Somatostatin receptor type 1
Name:Somatostatin receptor type 1
Type:Enzyme
Mol. Mass.:42692.81
Organism:Homo sapiens (Human)
Description:P30872
Residue:391
BDBM50021063
NameBDBM50021063
Synonyms:CHEMBL3287613
TypeSmall organic molecule
Emp. Form.C22H24FN3O
Mol. Mass.365.4439
SMILESFc1ccc(cc1)C(=O)N[C@@H]1CCCC[C@@H]1NCc1c[nH]c2ccccc12