Reaction Details
TargetSomatostatin receptor type 2
LigandBDBM50021063
Substrate/Competitorn/a
Meas. Tech.ChEMBL_1365879 (CHEMBL3296537)
Ki 311±n/a nM
Citation Li, DWu, ZYu, YBall, RGGuo, LSherer, EHe, SHong, QLai, ZQi, HTruong, QYang, DXChicchi, GGTsao, KLTrusca, DTrujillo, MPachanski, MEiermann, GJHoward, ADZhou, YPZhang, BBNargund, RPHagmann, WK Diamine Derivatives as Novel Small-Molecule, Potent, and Subtype-Selective Somatostatin SST3 Receptor Agonists. ACS Med Chem Lett5:690-5 (2014) 
 
Somatostatin receptor type 2
Name:Somatostatin receptor type 2
Type:Enzyme
Mol. Mass.:41344.94
Organism:Homo sapiens (Human)
Description:P30874
Residue:369
BDBM50021063
NameBDBM50021063
Synonyms:CHEMBL3287613
TypeSmall organic molecule
Emp. Form.C22H24FN3O
Mol. Mass.365.4439
SMILESFc1ccc(cc1)C(=O)N[C@@H]1CCCC[C@@H]1NCc1c[nH]c2ccccc12