Reaction Details
TargetSomatostatin receptor type 3
LigandBDBM50021066
Substrate/Competitorn/a
Meas. Tech.ChEMBL_1365873 (CHEMBL3296531)
Ki 37±n/a nM
Citation Li, DWu, ZYu, YBall, RGGuo, LSherer, EHe, SHong, QLai, ZQi, HTruong, QYang, DXChicchi, GGTsao, KLTrusca, DTrujillo, MPachanski, MEiermann, GJHoward, ADZhou, YPZhang, BBNargund, RPHagmann, WK Diamine Derivatives as Novel Small-Molecule, Potent, and Subtype-Selective Somatostatin SST3 Receptor Agonists. ACS Med Chem Lett5:690-5 (2014) 
 
Somatostatin receptor type 3
Name:Somatostatin receptor type 3
Type:Protein
Mol. Mass.:45855.97
Organism:Homo sapiens (Human)
Description:P32745
Residue:418
BDBM50021066
NameBDBM50021066
Synonyms:CHEMBL3287616
TypeSmall organic molecule
Emp. Form.C20H22F2N2O
Mol. Mass.344.3983
SMILESFc1ccc(CN[C@H]2CCCC[C@H]2NC(=O)c2ccc(F)cc2)cc1