Reaction Details
TargetSomatostatin receptor type 3
LigandBDBM50021090
Substrate/Competitorn/a
Meas. Tech.ChEMBL_1365873 (CHEMBL3296531)
Ki 3.7±n/a nM
Citation Li, DWu, ZYu, YBall, RGGuo, LSherer, EHe, SHong, QLai, ZQi, HTruong, QYang, DXChicchi, GGTsao, KLTrusca, DTrujillo, MPachanski, MEiermann, GJHoward, ADZhou, YPZhang, BBNargund, RPHagmann, WK Diamine Derivatives as Novel Small-Molecule, Potent, and Subtype-Selective Somatostatin SST3 Receptor Agonists. ACS Med Chem Lett5:690-5 (2014) 
 
Somatostatin receptor type 3
Name:Somatostatin receptor type 3
Type:Protein
Mol. Mass.:45855.97
Organism:Homo sapiens (Human)
Description:P32745
Residue:418
BDBM50021090
NameBDBM50021090
Synonyms:CHEMBL3287632
TypeSmall organic molecule
Emp. Form.C22H24FN3O
Mol. Mass.365.4439
SMILESFc1ccc(cc1)C(=O)N[C@@H]1CCCC[C@H]1NCc1c[nH]c2ccccc12