Reaction Details
TargetCytochrome P450 3A4
LigandBDBM50021261
Substrate/Competitorn/a
Meas. Tech.ChEMBL_1366300 (CHEMBL3297633)
IC50 17000±n/a nM
Citation Fader, LDCarson, RMorin, SBilodeau, FChabot, CHalmos, TBailey, MDKawai, SHCoulombe, RLaplante, SMekhssian, KJakalian, AGarneau, MDuan, JMason, SWSimoneau, BFenwick, CTsantrizos, YYoakim, C Minimizing the Contribution of Enterohepatic Recirculation to Clearance in Rat for the NCINI Class of Inhibitors of HIV. ACS Med Chem Lett5:711-6 (2014) 
 
Cytochrome P450 3A4
Name:Cytochrome P450 3A4
Type:Enzyme
Mol. Mass.:57349.57
Organism:Homo sapiens (Human)
Description:n/a
Residue:503
BDBM50021261
NameBDBM50021261
Synonyms:CHEMBL3287925
TypeSmall organic molecule
Emp. Form.C30H31ClN2O4
Mol. Mass.519.031
SMILESCc1noc(C)c1-c1ccc(cc1)-c1nc(C)c([C@H](OC(C)(C)C)C(O)=O)c(-c2ccc(Cl)cc2)c1C