Reaction Details
TargetIntegrase
LigandBDBM50021276
Substrate/Competitorn/a
Meas. Tech.ChEMBL_1366289 (CHEMBL3297622)
Kd 40±n/a nM
Citation Fader, LDCarson, RMorin, SBilodeau, FChabot, CHalmos, TBailey, MDKawai, SHCoulombe, RLaplante, SMekhssian, KJakalian, AGarneau, MDuan, JMason, SWSimoneau, BFenwick, CTsantrizos, YYoakim, C Minimizing the Contribution of Enterohepatic Recirculation to Clearance in Rat for the NCINI Class of Inhibitors of HIV. ACS Med Chem Lett5:711-6 (2014) 
 
Integrase
Name:Integrase
Synonyms:Human immunodeficiency virus type 1 integrase
Type:PROTEIN
Mol. Mass.:32231.48
Organism:Human immunodeficiency virus 1
Description:ChEMBL_90865
Residue:288
BDBM50021276
NameBDBM50021276
Synonyms:CHEMBL3287912
TypeSmall organic molecule
Emp. Form.C28H31NO4
Mol. Mass.445.55
SMILESCc1nc(c(C)c(-c2ccc3OCCCc3c2)c1[C@H](OC(C)(C)C)C(O)=O)-c1ccccc1