Reaction Details
TargetChymotrypsinogen A
LigandBDBM50069989
Substrate/Competitorn/a
Meas. Tech.ChEMBL_1366692 (CHEMBL3296843)
Ki 2400±n/a nM
Citation Troiano, VScarbaci, KEttari, RMicale, NCerchia, CPinto, ASchirmeister, TNovellino, EGrasso, SLavecchia, AZappalą, M Optimization of peptidomimetic boronates bearing a P3 bicyclic scaffold as proteasome inhibitors. Eur J Med Chem83:1-14 (2014) 
 
Chymotrypsinogen A
Name:Chymotrypsinogen A
Type:Serine protease
Mol. Mass.:25670.88
Organism:Bos taurus (bovine)
Description:n/a
Residue:245
BDBM50069989
NameBDBM50069989
Synonyms:(R)-3-methyl-1-((S)-3-phenyl-2-(pyrazine-2-carboxamido)propanamido)butylboronic acid BORTEZOMIB Dipeptidyl boronic acid derivative N-[(1R)-1-(DIHYDROXYBORYL)-3-METHYLBUTYL]-N-(PYRAZIN-2-YLCARBONYL)-L-PHENYLALANINAMIDE Peptidyl boronic acid derivative Velcade | cid_387447
TypeSmall organic molecule
Emp. Form.C19H25BN4O4
Mol. Mass.384.237
SMILESCC(C)C[C@H](NC(=O)[C@H](Cc1ccccc1)NC(=O)c1cnccn1)B(O)O