Reaction Details
TargetReceptor-type tyrosine-protein kinase FLT3
LigandBDBM50021568
Substrate/Competitorn/a
Meas. Tech.ChEMBL_1364702 (CHEMBL3293744)
IC50 9.3±n/a nM
Citation Zhou, SLiao, HHe, CDou, YJiang, MRen, LZhao, YGong, P Design, synthesis and structure-activity relationships of novel 4-phenoxyquinoline derivatives containing pyridazinone moiety as potential antitumor agents. Eur J Med Chem83:581-93 (2014) 
 
Receptor-type tyrosine-protein kinase FLT3
Name:Receptor-type tyrosine-protein kinase FLT3
Type:Enzyme
Mol. Mass.:112888.62
Organism:Homo sapiens (Human)
Description:P36888
Residue:993
BDBM50021568
NameBDBM50021568
Synonyms:CHEMBL3290931
TypeSmall organic molecule
Emp. Form.C36H33F4N5O6
Mol. Mass.707.6707
SMILESCOc1cc2c(Oc3ccc(NC(=O)c4nn(-c5ccccc5C(F)(F)F)c(=O)cc4C)cc3F)ccnc2cc1OCCCN1CCOCC1