Reaction Details
TargetVascular endothelial growth factor receptor 2
LigandBDBM50021568
Substrate/Competitorn/a
Meas. Tech.ChEMBL_1364704 (CHEMBL3293746)
IC50 425±n/a nM
Citation Zhou, SLiao, HHe, CDou, YJiang, MRen, LZhao, YGong, P Design, synthesis and structure-activity relationships of novel 4-phenoxyquinoline derivatives containing pyridazinone moiety as potential antitumor agents. Eur J Med Chem83:581-93 (2014) 
 
Vascular endothelial growth factor receptor 2
Name:Vascular endothelial growth factor receptor 2
Type:Receptor Tyrosine Kinase
Mol. Mass.:151510.97
Organism:Homo sapiens (Human)
Description:P35968
Residue:1356
BDBM50021568
NameBDBM50021568
Synonyms:CHEMBL3290931
TypeSmall organic molecule
Emp. Form.C36H33F4N5O6
Mol. Mass.707.6707
SMILESCOc1cc2c(Oc3ccc(NC(=O)c4nn(-c5ccccc5C(F)(F)F)c(=O)cc4C)cc3F)ccnc2cc1OCCCN1CCOCC1